Velocity Reviews - Computer Hardware Reviews

Velocity Reviews > Newsgroups > Programming > Perl > Perl Misc > GD.pm make test failed, help please?

Reply
Thread Tools

GD.pm make test failed, help please?

 
 
bopew2000
Guest
Posts: n/a
 
      09-07-2004
Hi guys,

I am trying to install GD.pm 2.15 on a Fedora 2 box. The make went fine, but
I got this when I do make test.
Any help please? Thanks!


# make test TEST_VERBOSE=1
PERL_DL_NONLAZY=1 /usr/bin/perl "-MExtUtils::Command::MM" "-e"
"test_harness(1, 'blib/lib', 'blib/arch')" t/*.t
t/GD..........1..10
ok 1
not ok 2
not ok 3
not ok 4
not ok 5
not ok 6
not ok 7
ok 8 # Skip, FreeType changes too frequently to be testable
ok 9 # Skip, no XPM support
not ok 10
FAILED tests 2-7, 10
Failed 7/10 tests, 30.00% okay (less 2 skipped tests: 1 okay,
10.00%)
t/Polyline....1..1
# Running under perl version 5.008003 for linux
# Current time local: Mon Sep 6 17:59:25 2004
# Current time GMT: Tue Sep 7 00:59:25 2004
# Using Test.pm version 1.24
ok 1
ok
Failed Test Stat Wstat Total Fail Failed List of Failed
----------------------------------------------------------------------------
---
t/GD.t 10 7 70.00% 2-7 10
2 subtests skipped.
Failed 1/2 test scripts, 50.00% okay. 7/11 subtests failed, 36.36% okay.
make: *** [test_dynamic] Error 255


 
Reply With Quote
 
 
 
 
Philip M. Gollucci
Guest
Posts: n/a
 
      09-07-2004
Hi,
> ok 8 # Skip, FreeType changes too frequently to be testable

This is okay
> ok 9 # Skip, no XPM support

This is okay
> not ok 10

This is a problem with GD::Image->newFromJpeg('frog.jpg')


you can always skip make test
and install it... Then figure out if what doesn't work is even something you need.



"bopew2000" <(E-Mail Removed)> wrote in message news:<2T7%c.101853$A8.1617@edtnps89>...
> Hi guys,
>
> I am trying to install GD.pm 2.15 on a Fedora 2 box. The make went fine, but
> I got this when I do make test.
> Any help please? Thanks!
>
>
> # make test TEST_VERBOSE=1
> PERL_DL_NONLAZY=1 /usr/bin/perl "-MExtUtils::Command::MM" "-e"
> "test_harness(1, 'blib/lib', 'blib/arch')" t/*.t
> t/GD..........1..10
> ok 1
> not ok 2
> not ok 3
> not ok 4
> not ok 5
> not ok 6
> not ok 7
> ok 8 # Skip, FreeType changes too frequently to be testable
> ok 9 # Skip, no XPM support
> not ok 10
> FAILED tests 2-7, 10
> Failed 7/10 tests, 30.00% okay (less 2 skipped tests: 1 okay,
> 10.00%)
> t/Polyline....1..1
> # Running under perl version 5.008003 for linux
> # Current time local: Mon Sep 6 17:59:25 2004
> # Current time GMT: Tue Sep 7 00:59:25 2004
> # Using Test.pm version 1.24
> ok 1
> ok
> Failed Test Stat Wstat Total Fail Failed List of Failed
> ----------------------------------------------------------------------------
> ---
> t/GD.t 10 7 70.00% 2-7 10
> 2 subtests skipped.
> Failed 1/2 test scripts, 50.00% okay. 7/11 subtests failed, 36.36% okay.
> make: *** [test_dynamic] Error 255

 
Reply With Quote
 
 
 
Reply

Thread Tools

Posting Rules
You may not post new threads
You may not post replies
You may not post attachments
You may not edit your posts

BB code is On
Smilies are On
[IMG] code is On
HTML code is Off
Trackbacks are On
Pingbacks are On
Refbacks are Off


Similar Threads
Thread Thread Starter Forum Replies Last Post
How to test python extension modules during 'make check' / 'make distcheck'? Mark Asbach Python 1 11-03-2006 02:29 AM
TEST TEST Test...Blah Blah Blah Generalbatguano@pacbell.net Computer Support 6 09-13-2006 01:53 AM
make test-all fails in test/drb on Mac OS X G B-) Ruby 1 02-15-2006 07:56 AM
TEST TEST TEST Gazwad Computer Support 2 09-05-2003 07:32 PM
test test test test test test test Computer Support 2 07-02-2003 06:02 PM



Advertisments