Velocity Reviews - Computer Hardware Reviews

Velocity Reviews > Newsgroups > Programming > Python > Compiling xpython: No rule to make target `runathana.py', needed by `frozen/frozen.c'.

Reply
Thread Tools

Compiling xpython: No rule to make target `runathana.py', needed by `frozen/frozen.c'.

 
 
est
Guest
Posts: n/a
 
      10-10-2010
I found an interesting project, it's a single 4.7 MB executable with
stdlib+PIL+pdf r/w+magpy+wxpython environment

But when compiling following the instructions

http://www.xpython.org/#compiling

there is an error

make: *** No rule to make target `runathana.py', needed by `frozen/
frozen.c'. Stop.

I am using Debian 4.0 32bit machine
 
Reply With Quote
 
 
 
 
est
Guest
Posts: n/a
 
      10-11-2010
On Oct 10, 7:40*pm, est <(E-Mail Removed)> wrote:
> I found an interesting project, it's a single 4.7 MB executable with
> stdlib+PIL+pdf r/w+magpy+wxpython environment
>
> But when compiling following the instructions
>
> http://www.xpython.org/#compiling
>
> there is an error
>
> make: *** No rule to make target `runathana.py', needed by `frozen/
> frozen.c'. *Stop.
>
> I am using Debian 4.0 32bit machine


Today I am trying to compile it using mingw (GNU Make 3.81) on Win7 32
bit and got this

In file included from Python/thread.c:121:
Python/thread_pthread.h: In function 'PyThread_start_new_thread':
Python/thread_pthread.h:200: error: aggregate value used where an
integer was expected
Python/thread_pthread.h: In function 'PyThread_get_thread_ident':
Python/thread_pthread.h:222: error: aggregate value used where an
integer was expected
make[1]: *** [Python/thread.o] Error 1
make[1]: Leaving directory `e:/dev/github.com/xpython/Python-linux'
mingw32-make: *** [Python-linux/python] Error 2

Can anyone help?
 
Reply With Quote
 
 
 
Reply

Thread Tools

Posting Rules
You may not post new threads
You may not post replies
You may not post attachments
You may not edit your posts

BB code is On
Smilies are On
[IMG] code is On
HTML code is Off
Trackbacks are On
Pingbacks are On
Refbacks are Off


Similar Threads
Thread Thread Starter Forum Replies Last Post
No rule to make target `Parser/printgrammar.o' ashish Python 0 11-24-2010 09:41 PM
gmake error: No rule to make target lib_file.a D3|\\||\\|!$ C++ 1 05-03-2008 06:50 AM
how to add validation rule for url in the validation-rule.xml ,I added some thing like this but......... shailajabtech@gmail.com Java 0 10-12-2006 08:36 AM
[XML Schema] Including a schema document with absent target namespace to a schema with specified target namespace Stanimir Stamenkov XML 3 04-25-2005 09:59 AM
1254-002 Cannot find a rule to create target /u02/apps_r/dev/ben/lib/fcfz02.a from dependencies. simduss@hotmail.com C Programming 4 10-07-2003 01:56 PM



Advertisments