Velocity Reviews - Computer Hardware Reviews

Velocity Reviews > Newsgroups > Programming > Python > Build problem on Solaris 9

Reply
Thread Tools

Build problem on Solaris 9

 
 
kai
Guest
Posts: n/a
 
      06-15-2009
Hi All,

When I run make after successively running ./configure, I got the
following Error message:
../Parser/asdl_c.py -c ./Python ./Parser/Python.asdl
/usr/bin/env: No such file or directory
make: *** [Python/Python-ast.c] Error 127

/usr/bin/env deos exist....

Can anyone help me with this?

Kai
 
Reply With Quote
 
 
 
 
Martin v. L÷wis
Guest
Posts: n/a
 
      06-16-2009
> When I run make after successively running ./configure, I got the
> following Error message:
> ./Parser/asdl_c.py -c ./Python ./Parser/Python.asdl
> /usr/bin/env: No such file or directory
> make: *** [Python/Python-ast.c] Error 127
>
> /usr/bin/env deos exist....
>
> Can anyone help me with this?


It's probably rather that "python" does not exist on the path,
which asdl_c.py requires.

touch Include/Python-ast.h Python/Python-ast.c

should work around.

Regards,
Martin
 
Reply With Quote
 
 
 
 
kai
Guest
Posts: n/a
 
      06-16-2009
On Jun 16, 12:15*am, "Martin v. L÷wis" <(E-Mail Removed)> wrote:
> > When I run make after successively running ./configure, I got the
> > following Error message:
> > ./Parser/asdl_c.py -c ./Python ./Parser/Python.asdl
> > /usr/bin/env: No such file or directory
> > make: *** [Python/Python-ast.c] Error 127

Thank you so much!!!

It compiles now.

Kai

>
> > /usr/bin/env deos exist....

>
> > Can anyone help me with this?

>
> It's probably rather that "python" does not exist on the path,
> which asdl_c.py requires.
>
> touch Include/Python-ast.h Python/Python-ast.c
>
> should work around.
>
> Regards,
> Martin


 
Reply With Quote
 
 
 
Reply

Thread Tools

Posting Rules
You may not post new threads
You may not post replies
You may not post attachments
You may not edit your posts

BB code is On
Smilies are On
[IMG] code is On
HTML code is Off
Trackbacks are On
Pingbacks are On
Refbacks are Off


Similar Threads
Thread Thread Starter Forum Replies Last Post
build problem in solaris when building idutils-4.2 naagu C++ 0 07-20-2011 07:48 AM
Solaris 10 + Sun Studio 12 Pyrhon 2.4.4 64-bit build problem plumb and tree Python 7 10-30-2007 05:23 PM
SWsoft Acronis Disk Director Suite 9.0 Build 508, Acronis OS Selector 8.0 Build 917, Acronis Partition Expert 2003 Build 292, Acronis Power Utilities 2004 Build 502, F-SECURE.ANTI vIRUS.PROXY v1.10.17.WINALL, F-SECURE.ANTI vIRUS v5.50.10260 for CITRI vvcd Computer Support 0 09-25-2004 01:38 AM
Build failing on Solaris Karl Hanzel Python 2 12-02-2003 09:05 PM
_ssl.so build problems on Solaris 8 for 2.3 Skip Montanaro Python 2 09-16-2003 02:31 PM



Advertisments