Velocity Reviews - Computer Hardware Reviews

Velocity Reviews > Newsgroups > Programming > Python > scons Buffer.cpp

Reply
Thread Tools

scons Buffer.cpp

 
 
brnstrmrs
Guest
Posts: n/a
 
      03-13-2008
I am trying to install some libs but can not get them build properly.
It seems to be looking for Buffer.cpp but can't find it any where .
Here is the error message:
scons: Reading SConscript files ...
scons: done reading SConscript files.
scons: Building targets ...
g++ -o AssociationRejection.o -c -I/usr/lib -I/usr/lib/boost
AssociationRejection.cpp
g++ -o Buffer.o -c -I/usr/lib -I/usr/lib/boost Buffer.cpp
In file included from Buffer.cpp:1:
Buffer.hpp:9:27: error: socket/Base.hpp: No such file or directory
Buffer.hpp:10:35: error: socket/SwitchEndian.hpp: No such file or
directory
Buffer.hpp: In member function 'dicom::Buffer&
dicom::Buffer:perator<<(T)':
Buffer.hpp:84: error: 'is_fundamental' is not a member of 'boost'
Buffer.hpp:84: error: '::value' has not been declared
Buffer.hpp:90: error: template argument 1 is invalid
Buffer.hpp:95: error: template argument 1 is invalid
Buffer.hpp:96: error: expected unqualified-id before '}' token
Buffer.hpp: In member function 'dicom::Buffer&
dicom::Buffer:perator>>(T&)':
Buffer.hpp:103: error: 'is_const' is not a member of 'boost'
Buffer.hpp:103: error: '::value' has not been declared
Buffer.hpp:104: error: template argument 1 is invalid
Buffer.hpp:105: error: template argument 1 is invalid
Buffer.hpp:105: error: invalid type in declaration before ';' token
Buffer.hpp:105: error: declaration of 'typedef int& data' shadows a
parameter
Buffer.hpp:109: error: 'pdata' was not declared in this scope
Buffer.hpp:117: error: expected unqualified-id before '=' token
Buffer.cpp: In member function 'dicom::Buffer&
dicom::Buffer:perator>>(std::vector<short unsigned int,
std::allocator<short unsigned int> >&)':
Buffer.cpp:38: error: 'SwitchVectorEndian' was not declared in this
scope
Buffer.cpp: In member function 'void dicom::Buffer::AddVector(const
std::vector<short unsigned int, std::allocator<short unsigned int>
>&)':

Buffer.cpp:112: error: 'SwitchVectorEndian' was not declared in this
scope
Buffer.hpp: In member function 'dicom::Buffer&
dicom::Buffer:perator>>(T&) [with T = char]':
Buffer.cpp:51: instantiated from here
Buffer.hpp:105: error: declaration of 'typedef int& data' shadows a
parameter
Buffer.hpp: In member function 'dicom::Buffer&
dicom::Buffer:perator>>(T&) [with T = UINT16]':
Buffer.cpp:59: instantiated from here
Buffer.hpp:105: error: declaration of 'typedef int& data' shadows a
parameter
scons: *** [Buffer.o] Error 1
scons: building terminated because of errors.
 
Reply With Quote
 
 
 
Reply

Thread Tools

Posting Rules
You may not post new threads
You may not post replies
You may not post attachments
You may not edit your posts

BB code is On
Smilies are On
[IMG] code is On
HTML code is Off
Trackbacks are On
Pingbacks are On
Refbacks are Off


Similar Threads
Thread Thread Starter Forum Replies Last Post
SCons build tool speed ted Python 8 02-14-2005 01:39 AM
[ANN] Updated Version of the SCons Builder Plugin Lothar Werzinger C++ 1 12-27-2004 09:09 PM
ANN: SCons.0.96 adds Fortran 90/95 support, better Qt support,platform-independent file system actions, improved debugging, lots more Steven Knight Python 0 08-18-2004 03:57 PM
ANNOUNCE: SCons 0.94 adds command-line argument features, fixeskey bugs Steven Knight Python 0 11-07-2003 04:56 PM
ANNOUNCE: SCons 0.93 releases User's Guide,adds usability enhancements Steven Knight Python 0 10-23-2003 03:05 PM



Advertisments