Velocity Reviews - Computer Hardware Reviews

Velocity Reviews > Newsgroups > Programming > Python > Python Dies on "make install"

Reply
Thread Tools

Python Dies on "make install"

 
 
fartknuckle
Guest
Posts: n/a
 
      08-10-2007

When I try to build and install python from source It configures and
makes fine but upon 'make install' I always get to this
point:



Listing /usr/local/lib/python2.5/xml/sax ...
Compiling /usr/local/lib/python2.5/xml/sax/__init__.py ...
Compiling /usr/local/lib/python2.5/xml/sax/_exceptions.py ...
Compiling /usr/local/lib/python2.5/xml/sax/expatreader.py ...
Compiling /usr/local/lib/python2.5/xml/sax/handler.py ...
Compiling /usr/local/lib/python2.5/xml/sax/saxutils.py ...
Compiling /usr/local/lib/python2.5/xml/sax/xmlreader.py ...
Compiling /usr/local/lib/python2.5/xmllib.py ...
Compiling /usr/local/lib/python2.5/xmlrpclib.py ...
Compiling /usr/local/lib/python2.5/zipfile.py ...
make: *** [libinstall] Error 1



I am currently trying to install 2.5.1. I get the error no matter what the
version is. Does anyone have an idea what may be causing this?

I have gone through the config.log and found no errors concerning
zipfile.py or zipfile or zip. I am thinking the error is the next command
after the zipfile.py installation because I can go into
/usr/local/lib/python2.5 and zipfile.py is installed.

Any help much appreciated.

Thanks



--
Take summa dis punk!
 
Reply With Quote
 
 
 
 
Jarek Zgoda
Guest
Posts: n/a
 
      08-10-2007
fartknuckle napisał(a):

> When I try to build and install python from source It configures and
> makes fine but upon 'make install' I always get to this
> point:
>
>
>
> Listing /usr/local/lib/python2.5/xml/sax ...
> Compiling /usr/local/lib/python2.5/xml/sax/__init__.py ...
> Compiling /usr/local/lib/python2.5/xml/sax/_exceptions.py ...
> Compiling /usr/local/lib/python2.5/xml/sax/expatreader.py ...
> Compiling /usr/local/lib/python2.5/xml/sax/handler.py ...
> Compiling /usr/local/lib/python2.5/xml/sax/saxutils.py ...
> Compiling /usr/local/lib/python2.5/xml/sax/xmlreader.py ...
> Compiling /usr/local/lib/python2.5/xmllib.py ...
> Compiling /usr/local/lib/python2.5/xmlrpclib.py ...
> Compiling /usr/local/lib/python2.5/zipfile.py ...
> make: *** [libinstall] Error 1
>
>
>
> I am currently trying to install 2.5.1. I get the error no matter what the
> version is. Does anyone have an idea what may be causing this?
>
> I have gone through the config.log and found no errors concerning
> zipfile.py or zipfile or zip. I am thinking the error is the next command
> after the zipfile.py installation because I can go into
> /usr/local/lib/python2.5 and zipfile.py is installed.
>
> Any help much appreciated.


I saw this (and reported this issue in SF's tracker) at some time around
2.2/2.3 (just cann't recall). I don't know what causes this problem
exactly, but in my case the installation succeeded if I removed prevoius
python's library directory (/usr/lib/python2.x or
/usr/local/lib/python2.x). The module that stopped installation was
exactly the same.

--
Jarek Zgoda
http://jpa.berlios.de/
 
Reply With Quote
 
 
 
 
fartknuckle
Guest
Posts: n/a
 
      08-10-2007
On Fri, 10 Aug 2007 23:39:39 +0200, Jarek Zgoda wrote:

> fartknuckle :
>
>> When I try to build and install python from source It configures and
>> makes fine but upon 'make install' I always get to this
>> point:
>>
>>
>>
>> Listing /usr/local/lib/python2.5/xml/sax ...
>> Compiling /usr/local/lib/python2.5/xml/sax/__init__.py ...
>> Compiling /usr/local/lib/python2.5/xml/sax/_exceptions.py ...
>> Compiling /usr/local/lib/python2.5/xml/sax/expatreader.py ...
>> Compiling /usr/local/lib/python2.5/xml/sax/handler.py ...
>> Compiling /usr/local/lib/python2.5/xml/sax/saxutils.py ...
>> Compiling /usr/local/lib/python2.5/xml/sax/xmlreader.py ...
>> Compiling /usr/local/lib/python2.5/xmllib.py ...
>> Compiling /usr/local/lib/python2.5/xmlrpclib.py ...
>> Compiling /usr/local/lib/python2.5/zipfile.py ...
>> make: *** [libinstall] Error 1
>>
>>
>>
>> I am currently trying to install 2.5.1. I get the error no matter what the
>> version is. Does anyone have an idea what may be causing this?
>>
>> I have gone through the config.log and found no errors concerning
>> zipfile.py or zipfile or zip. I am thinking the error is the next command
>> after the zipfile.py installation because I can go into
>> /usr/local/lib/python2.5 and zipfile.py is installed.
>>
>> Any help much appreciated.

>
> I saw this (and reported this issue in SF's tracker) at some time around
> 2.2/2.3 (just cann't recall). I don't know what causes this problem
> exactly, but in my case the installation succeeded if I removed prevoius
> python's library directory (/usr/lib/python2.x or
> /usr/local/lib/python2.x). The module that stopped installation was
> exactly the same.


That did the trick, thanks a million.




--
Take summa dis punk!
 
Reply With Quote
 
 
 
Reply

Thread Tools

Posting Rules
You may not post new threads
You may not post replies
You may not post attachments
You may not edit your posts

BB code is On
Smilies are On
[IMG] code is On
HTML code is Off
Trackbacks are On
Pingbacks are On
Refbacks are Off


Similar Threads
Thread Thread Starter Forum Replies Last Post
python make dies :libtk8.5.so: cannot open shared object file: Nosuch file or directory Tony Lay Python 1 07-13-2009 02:24 PM
infinite loop unexpectly dies Vedran Vukotic Perl 0 03-02-2006 07:43 AM
Echo Reply dies at pix alex Cisco 3 07-29-2004 06:40 PM
Net::SNMP dies on any OID error and doesn't return other possibly good values dan byers Perl 1 03-06-2004 09:50 AM
Perl 'system' Creates Program That Dies When First C Program Dies Christopher M. Lusardi Perl Misc 3 10-19-2003 11:53 AM



Advertisments