Velocity Reviews - Computer Hardware Reviews

Velocity Reviews > Newsgroups > Programming > Python > Problems Compiling PyQt3.7

Reply
Thread Tools

Problems Compiling PyQt3.7

 
 
mazu
Guest
Posts: n/a
 
      07-10-2003
I get errors about QAssistantClient while compiling PyQt 3.7, on my
debian woody with Qt 3.1.2. Here is compiler message:

cd qt && /usr/bin/make -f Makefile
make[1]: Entering directory `/Downloads/KDE - libs/PyQt-x11-gpl-3.7/qt'
g++ -c -pipe -w -O2 -D_REENTRANT -fPIC -DSIP_MAKE_MODULE_DLL
-DQT_NO_DEBUG -DQT_THREAD_SUPPORT -I/usr/share/qt3/mkspecs/default -I. -I.
-I/usr/include/python2.1 -I/usr/share/qt3/include -o qtcmodule.o
qtcmodule.cpp
In file included from qtcmodule.cpp:37:
sip/qassistantclient.sip:37: qassistantclient.h: No such file or directory
In file included from qtcmodule.cpp:37:
sipqtQAssistantClient.h:42: parse error before `{'
sipqtQAssistantClient.h:45: destructors must be member functions
sipqtQAssistantClient.h:49: non-member function `property(const char *)'
cannot have `const' method qualifier
sipqtQAssistantClient.h:82: parse error before `private'
sipqtQAssistantClient.h:84: syntax error before `&'
sipqtQAssistantClient.h:87: parse error before `}'
sipqtQAssistantClient.h:89: syntax error before `*'
make[1]: *** [qtcmodule.o] Error 1
make[1]: Leaving directory `/Downloads/KDE - libs/PyQt-x11-gpl-3.7/qt'
make: *** [sub-qt] Error 2

Anybody know any solution to this problem? I've got libqt3-mt,
libqt3-mt-dev, and Qt 3.1.2already installed.

--
mazu

 
Reply With Quote
 
 
 
 
Michael 'Mickey' Lauer
Guest
Posts: n/a
 
      07-10-2003
mazu <(E-Mail Removed)> wrote:
> I get errors about QAssistantClient while compiling PyQt 3.7, on my
> debian woody with Qt 3.1.2. Here is compiler message:
>
> cd qt && /usr/bin/make -f Makefile
> make[1]: Entering directory `/Downloads/KDE - libs/PyQt-x11-gpl-3.7/qt'
> g++ -c -pipe -w -O2 -D_REENTRANT -fPIC -DSIP_MAKE_MODULE_DLL
> -DQT_NO_DEBUG -DQT_THREAD_SUPPORT -I/usr/share/qt3/mkspecs/default -I. -I.
> -I/usr/include/python2.1 -I/usr/share/qt3/include -o qtcmodule.o
> qtcmodule.cpp
> In file included from qtcmodule.cpp:37:
> sip/qassistantclient.sip:37: qassistantclient.h: No such file or directory
> In file included from qtcmodule.cpp:37:
> sipqtQAssistantClient.h:42: parse error before `{'
> sipqtQAssistantClient.h:45: destructors must be member functions
> sipqtQAssistantClient.h:49: non-member function `property(const char *)'
> cannot have `const' method qualifier
> sipqtQAssistantClient.h:82: parse error before `private'
> sipqtQAssistantClient.h:84: syntax error before `&'
> sipqtQAssistantClient.h:87: parse error before `}'
> sipqtQAssistantClient.h:89: syntax error before `*'
> make[1]: *** [qtcmodule.o] Error 1
> make[1]: Leaving directory `/Downloads/KDE - libs/PyQt-x11-gpl-3.7/qt'
> make: *** [sub-qt] Error 2
>
> Anybody know any solution to this problem? I've got libqt3-mt,
> libqt3-mt-dev, and Qt 3.1.2already installed.


Seems your distribution is missing files. Download the Qt-3.1.2 source and
copy the missing files into $QTDIR/include.

:M:
 
Reply With Quote
 
 
 
Reply

Thread Tools

Posting Rules
You may not post new threads
You may not post replies
You may not post attachments
You may not edit your posts

BB code is On
Smilies are On
[IMG] code is On
HTML code is Off
Trackbacks are On
Pingbacks are On
Refbacks are Off


Similar Threads
Thread Thread Starter Forum Replies Last Post
Re: Cross-compiling error when compiling 2.6.1... Garrett Cooper Python 0 02-24-2009 09:47 PM
Cross-compiling error when compiling 2.6.1... Garrett Cooper Python 0 02-24-2009 08:55 PM
Problems compiling simple C++ code (also problems with std::string) Susan Baker C++ 2 06-26-2005 01:43 AM
Compiling when libedit is in path Is there a trick to compiling Ruby when libedit must exist in the search path? Can you statically link to readline 5.0 in some manner? -- Lon Baker Lon Baker Ruby 1 03-21-2005 08:57 AM
Problems when compiling Windows Control when using references to class libraries pataN ASP .Net 1 08-22-2003 02:52 PM



Advertisments